BDBM50339686 4-(2-Fluoroethoxy)-N-(4-(4-(2-(2-fluoroethoxy)phenyl)piperazin-1-yl)butyl)benzamide oxalic acid salt::CHEMBL1689004
SMILES FCCOc1ccc(cc1)C(=O)NCCCCN1CCN(CC1)c1ccccc1OCCF
InChI Key InChIKey=GRUWUINXLANFJE-UHFFFAOYSA-N
Data  5 KI
  Tab Delimited (TSV)   2D SDfile   Computed 3D by Vconf -m prep SDfile
Find this compound or compounds like it in BindingDB:
Activity Spreadsheet -- Enzyme Inhibition Constant Data from BindingDB
Found 1 hit for monomerid = 50339686
TargetAP-2 complex subunit sigma(RAT)
Washington University
Curated by ChEMBL
LigandPNGBDBM50339686(4-(2-Fluoroethoxy)-N-(4-(4-(2-(2-fluoroethoxy)phen...)
Affinity DataKi:  794nM. Assay description: Displacement of [3H]-DTG from rat sigma2 receptor by liquid scintillation counting
In DepthDetails ArticlePubMed